configure: error: C preprocessor "/lib/cpp" fails sanity check

classic Classic list List threaded Threaded
6 messages Options
Reply | Threaded
Open this post in threaded view
|

configure: error: C preprocessor "/lib/cpp" fails sanity check

Óscar Fuentes
Building development gcc with MSYS stops with that error. It happens
with `trunk' and with gcc-4_8-branch. Any suggestions?

$ ../gcc/configure --enable-languages=c,c++ --prefix=/c/MinGW/gcc-dev
$ make -j4

checking for /d/dev/other/gcc/build/./gcc/xgcc -B/d/dev/other/gcc/build/./gcc/ -
L/d/dev/other/gcc/build/i686-pc-mingw32/winsup/mingw -L/d/dev/other/gcc/build/i6
86-pc-mingw32/winsup/w32api/lib -isystem /d/dev/other/gcc/gcc/winsup/mingw/inclu
de -isystem /d/dev/other/gcc/gcc/winsup/w32api/include -B/c/MinGW/gcc-dev/i686-p
c-mingw32/bin/ -B/c/MinGW/gcc-dev/i686-pc-mingw32/lib/ -isystem /c/MinGW/gcc-dev
/i686-pc-mingw32/include -isystem /c/MinGW/gcc-dev/i686-pc-mingw32/sys-include
  option to accept ISO C89... unsupported
checking how to run the C preprocessor... /lib/cpp
configure: error: in `/d/dev/other/gcc/build/i686-pc-mingw32/libgcc':
configure: error: C preprocessor "/lib/cpp" fails sanity check
See `config.log' for more details.
make[2]: *** [configure-stage1-target-libgcc] Error 1
make[2]: Leaving directory `/d/dev/other/gcc/build'
make[1]: *** [stage1-bubble] Error 2
make[1]: Leaving directory `/d/dev/other/gcc/build'
make: *** [all] Error 2


------------------------------------------------------------------------------
This SF.net email is sponsored by Windows:

Build for Windows Store.

http://p.sf.net/sfu/windows-dev2dev
_______________________________________________
MinGW-users mailing list
[hidden email]

This list observes the Etiquette found at
http://www.mingw.org/Mailing_Lists.
We ask that you be polite and do the same.  Disregard for the list etiquette may cause your account to be moderated.

_______________________________________________
You may change your MinGW Account Options or unsubscribe at:
https://lists.sourceforge.net/lists/listinfo/mingw-users
Also: mailto:[hidden email]?subject=unsubscribe
Reply | Threaded
Open this post in threaded view
|

Re: configure: error: C preprocessor "/lib/cpp" fails sanity check

lrn-2
-----BEGIN PGP SIGNED MESSAGE-----
Hash: SHA1

On 12.06.2013 19:08, Óscar Fuentes wrote:

> Building development gcc with MSYS stops with that error. It happens
> with `trunk' and with gcc-4_8-branch. Any suggestions?
>
> $ ../gcc/configure --enable-languages=c,c++ --prefix=/c/MinGW/gcc-dev
> $ make -j4
>
> checking for /d/dev/other/gcc/build/./gcc/xgcc -B/d/dev/other/gcc/build/./gcc/ -
> L/d/dev/other/gcc/build/i686-pc-mingw32/winsup/mingw -L/d/dev/other/gcc/build/i6
> 86-pc-mingw32/winsup/w32api/lib -isystem /d/dev/other/gcc/gcc/winsup/mingw/inclu
> de -isystem /d/dev/other/gcc/gcc/winsup/w32api/include -B/c/MinGW/gcc-dev/i686-p
> c-mingw32/bin/ -B/c/MinGW/gcc-dev/i686-pc-mingw32/lib/ -isystem /c/MinGW/gcc-dev
> /i686-pc-mingw32/include -isystem /c/MinGW/gcc-dev/i686-pc-mingw32/sys-include
>   option to accept ISO C89... unsupported
> checking how to run the C preprocessor... /lib/cpp
> configure: error: in `/d/dev/other/gcc/build/i686-pc-mingw32/libgcc':
> configure: error: C preprocessor "/lib/cpp" fails sanity check
> See `config.log' for more details.
> make[2]: *** [configure-stage1-target-libgcc] Error 1
> make[2]: Leaving directory `/d/dev/other/gcc/build'
> make[1]: *** [stage1-bubble] Error 2
> make[1]: Leaving directory `/d/dev/other/gcc/build'
> make: *** [all] Error 2
>

Off the top of my head, checking for /lib/cpp usually means that
configure looked for a few *other* preprocessor names, and ended up with
/lib/cpp, because it couldn't find anything else.

The code looks like this usually:
for CPP in "$CC -E" "$CC -E -traditional-cpp" "/lib/cpp"

That is, you have problems with $CC.

And building gcc may be somewhat more complex than what you are doing.

- --
O< ascii ribbon - stop html email! - www.asciiribbon.org
-----BEGIN PGP SIGNATURE-----
Version: GnuPG v1.4.11 (MingW32)

iQEcBAEBAgAGBQJRuJyHAAoJEOs4Jb6SI2CwFHUIAIAx71iFNrKcALw4G6zSL8ZS
pjaquzTLEYhNalfpm1itAGwaOaMDA9ijX0vQhUN/+bniO8ZQe2BagAxlwurNTdZp
usBYSDT3oJEwbY0e/0sVeNS4oQjUX5cG7pTnTKLLz5kRpUKO742c1UkLwBk8usRl
QM5LwNf63Rg7Zt7oKgPnjJWLaArne3m3k0eAq7hdysFwloKkb/qbODY+JlRPckVE
eWglunWceV3bkKS8Bl6KtMWnRgoL8b+hJ0PwLIsGZjiqOqrqxzhLDIFIZreLYLE+
Ef0Lnq4ogGF/gjg+IW9JKGYpd3JXnVu1e2uqlcKGT2hjOJYe5ESnad9AyKgOqQo=
=4Q3M
-----END PGP SIGNATURE-----

------------------------------------------------------------------------------
This SF.net email is sponsored by Windows:

Build for Windows Store.

http://p.sf.net/sfu/windows-dev2dev
_______________________________________________
MinGW-users mailing list
[hidden email]

This list observes the Etiquette found at
http://www.mingw.org/Mailing_Lists.
We ask that you be polite and do the same.  Disregard for the list etiquette may cause your account to be moderated.

_______________________________________________
You may change your MinGW Account Options or unsubscribe at:
https://lists.sourceforge.net/lists/listinfo/mingw-users
Also: mailto:[hidden email]?subject=unsubscribe
Reply | Threaded
Open this post in threaded view
|

Re: configure: error: C preprocessor "/lib/cpp" fails sanity check

Eli Zaretskii
In reply to this post by Óscar Fuentes
> From: Óscar Fuentes <[hidden email]>
> Date: Wed, 12 Jun 2013 17:08:29 +0200
>
> Building development gcc with MSYS stops with that error. It happens
> with `trunk' and with gcc-4_8-branch. Any suggestions?
>
> $ ../gcc/configure --enable-languages=c,c++ --prefix=/c/MinGW/gcc-dev
> $ make -j4
>
> checking for /d/dev/other/gcc/build/./gcc/xgcc -B/d/dev/other/gcc/build/./gcc/ -
> L/d/dev/other/gcc/build/i686-pc-mingw32/winsup/mingw -L/d/dev/other/gcc/build/i6
> 86-pc-mingw32/winsup/w32api/lib -isystem /d/dev/other/gcc/gcc/winsup/mingw/inclu
> de -isystem /d/dev/other/gcc/gcc/winsup/w32api/include -B/c/MinGW/gcc-dev/i686-p
> c-mingw32/bin/ -B/c/MinGW/gcc-dev/i686-pc-mingw32/lib/ -isystem /c/MinGW/gcc-dev
> /i686-pc-mingw32/include -isystem /c/MinGW/gcc-dev/i686-pc-mingw32/sys-include
>   option to accept ISO C89... unsupported

Must be some stupid snafu...

Is /d/dev/ your invention, or is it something enforced by the GCC
build?  I really don't like file names with /dev/ in them, who knows
what Bash will make out of it.  Anyway...

> checking how to run the C preprocessor... /lib/cpp
> configure: error: in `/d/dev/other/gcc/build/i686-pc-mingw32/libgcc':
> configure: error: C preprocessor "/lib/cpp" fails sanity check
> See `config.log' for more details.
  ^^^^^^^^^^^^^^^^^^^^^^^^^^^^^^^^^
Well, did you?  It usually spells out the problems loud and clear.


------------------------------------------------------------------------------
This SF.net email is sponsored by Windows:

Build for Windows Store.

http://p.sf.net/sfu/windows-dev2dev
_______________________________________________
MinGW-users mailing list
[hidden email]

This list observes the Etiquette found at
http://www.mingw.org/Mailing_Lists.
We ask that you be polite and do the same.  Disregard for the list etiquette may cause your account to be moderated.

_______________________________________________
You may change your MinGW Account Options or unsubscribe at:
https://lists.sourceforge.net/lists/listinfo/mingw-users
Also: mailto:[hidden email]?subject=unsubscribe
Reply | Threaded
Open this post in threaded view
|

Re: configure: error: C preprocessor "/lib/cpp" fails sanity check

Óscar Fuentes
Eli Zaretskii <[hidden email]> writes:

> Must be some stupid snafu...
>
> Is /d/dev/ your invention, or is it something enforced by the GCC
> build?  I really don't like file names with /dev/ in them, who knows
> what Bash will make out of it.  Anyway...

`dev' is the directory I use for development. Hope that Bash et al.
knows the difference among /d/dev and /dev. I'm using that naming for
years and this would be the first time a problem happens.

>> checking how to run the C preprocessor... /lib/cpp
>> configure: error: in `/d/dev/other/gcc/build/i686-pc-mingw32/libgcc':
>> configure: error: C preprocessor "/lib/cpp" fails sanity check
>> See `config.log' for more details.
>   ^^^^^^^^^^^^^^^^^^^^^^^^^^^^^^^^^
> Well, did you?  It usually spells out the problems loud and clear.

The `make' output says that it is working on the top directory, but the
config.log there contains the output of the initial configure run. I've
searched the build directory for the most recent modified config.log,
but no error there. So I don't know what config.log file the output is
talking about.


------------------------------------------------------------------------------
This SF.net email is sponsored by Windows:

Build for Windows Store.

http://p.sf.net/sfu/windows-dev2dev
_______________________________________________
MinGW-users mailing list
[hidden email]

This list observes the Etiquette found at
http://www.mingw.org/Mailing_Lists.
We ask that you be polite and do the same.  Disregard for the list etiquette may cause your account to be moderated.

_______________________________________________
You may change your MinGW Account Options or unsubscribe at:
https://lists.sourceforge.net/lists/listinfo/mingw-users
Also: mailto:[hidden email]?subject=unsubscribe
Reply | Threaded
Open this post in threaded view
|

Re: configure: error: C preprocessor "/lib/cpp" fails sanity check

Eli Zaretskii
> From: Óscar Fuentes <[hidden email]>
> Date: Wed, 12 Jun 2013 19:47:09 +0200
>
> >> See `config.log' for more details.
> >   ^^^^^^^^^^^^^^^^^^^^^^^^^^^^^^^^^
> > Well, did you?  It usually spells out the problems loud and clear.
>
> The `make' output says that it is working on the top directory, but the
> config.log there contains the output of the initial configure run. I've
> searched the build directory for the most recent modified config.log,
> but no error there. So I don't know what config.log file the output is
> talking about.

Are you saying that you don't see any config.log that has this string:

  checking how to run the C preprocessor

in it?

Anyway, you should be able to see what file is that e.g. by launching
Process Explorer or a similar tool while that configure script (the
one which complains about cpp) is running, and looking at the files
that Bash has open at that time.

(Is it possible that the log is redirected to /dev/null?  Stupid, I
know, but we are talking about stupid things anyway.)

In my experience, guessing what could be the reason of such snafus is
a waste of time; it is much more important to find the config.log file
and read its relevant parts.


------------------------------------------------------------------------------
This SF.net email is sponsored by Windows:

Build for Windows Store.

http://p.sf.net/sfu/windows-dev2dev
_______________________________________________
MinGW-users mailing list
[hidden email]

This list observes the Etiquette found at
http://www.mingw.org/Mailing_Lists.
We ask that you be polite and do the same.  Disregard for the list etiquette may cause your account to be moderated.

_______________________________________________
You may change your MinGW Account Options or unsubscribe at:
https://lists.sourceforge.net/lists/listinfo/mingw-users
Also: mailto:[hidden email]?subject=unsubscribe
Reply | Threaded
Open this post in threaded view
|

Re: configure: error: C preprocessor "/lib/cpp" fails sanity check

Óscar Fuentes
Eli Zaretskii <[hidden email]> writes:

>> From: Óscar Fuentes <[hidden email]>
>> Date: Wed, 12 Jun 2013 19:47:09 +0200
>>
>> >> See `config.log' for more details.
>> >   ^^^^^^^^^^^^^^^^^^^^^^^^^^^^^^^^^
>> > Well, did you?  It usually spells out the problems loud and clear.
>>
>> The `make' output says that it is working on the top directory, but the
>> config.log there contains the output of the initial configure run. I've
>> searched the build directory for the most recent modified config.log,
>> but no error there. So I don't know what config.log file the output is
>> talking about.
>
> Are you saying that you don't see any config.log that has this string:
>
>   checking how to run the C preprocessor
>
> in it?
>
> Anyway, you should be able to see what file is that e.g. by launching
> Process Explorer or a similar tool while that configure script (the
> one which complains about cpp) is running, and looking at the files
> that Bash has open at that time.
>
> (Is it possible that the log is redirected to /dev/null?  Stupid, I
> know, but we are talking about stupid things anyway.)
>
> In my experience, guessing what could be the reason of such snafus is
> a waste of time; it is much more important to find the config.log file
> and read its relevant parts.

Okay, found it. The end of the error log was 150 lines up the last line
of the config.log file (which a text search revealed that it was on
$build/i686-pc-mingw32/libgcc directory).

For checking how to run the C preprocessor the script tries to
preprocess several source files, each #including a well-known header
file. They all fail because the include search path does not contain the
place where the MinGW header files are installed. This is because it
uses the directory specified in --prefix configure option, but I
assigned that option to an empty directory instead of c:/MinGW (hoping
to install the new gcc somewhere without overwriting the existing one.)
Now I'm trying again using --prefix=c:/mingw. Let's see how it fares.

configure:3833: checking how to run the C preprocessor
configure:3864: /d/dev/other/gcc/build/./gcc/xgcc -B/d/dev/other/gcc/build/./gcc/ -L/d/dev/other/gcc/build/i686-pc-mingw32/winsup/mingw -L/d/dev/other/gcc/build/i686-pc-mingw32/winsup/w32api/lib -isystem /d/dev/other/gcc/gcc/winsup/mingw/include -isystem /d/dev/other/gcc/gcc/winsup/w32api/include -B/c/MinGW/gcc-dev/i686-pc-mingw32/bin/ -B/c/MinGW/gcc-dev/i686-pc-mingw32/lib/ -isystem /c/MinGW/gcc-dev/i686-pc-mingw32/include -isystem /c/MinGW/gcc-dev/i686-pc-mingw32/sys-include    -E  conftest.c
In file included from d:/dev/other/gcc/build/gcc/include-fixed/syslimits.h:7:0,
                 from d:/dev/other/gcc/build/gcc/include-fixed/limits.h:34,
                 from conftest.c:10:
d:/dev/other/gcc/build/gcc/include-fixed/limits.h:168:61: error: no include path in which to search for limits.h
 #include_next <limits.h>  /* recurse down to the real one */
                                                             ^
configure:3864: $? = 1
configure: failed program was:
| /* confdefs.h */
| #define PACKAGE_NAME "GNU C Runtime Library"
| #define PACKAGE_TARNAME "libgcc"
| #define PACKAGE_VERSION "1.0"
| #define PACKAGE_STRING "GNU C Runtime Library 1.0"
| #define PACKAGE_BUGREPORT ""
| #define PACKAGE_URL "http://www.gnu.org/software/libgcc/"
| /* end confdefs.h.  */
| #ifdef __STDC__
| # include <limits.h>
| #else
| # include <assert.h>
| #endif
|     Syntax error
configure:3864: /d/dev/other/gcc/build/./gcc/xgcc -B/d/dev/other/gcc/build/./gcc/ -L/d/dev/other/gcc/build/i686-pc-mingw32/winsup/mingw -L/d/dev/other/gcc/build/i686-pc-mingw32/winsup/w32api/lib -isystem /d/dev/other/gcc/gcc/winsup/mingw/include -isystem /d/dev/other/gcc/gcc/winsup/w32api/include -B/c/MinGW/gcc-dev/i686-pc-mingw32/bin/ -B/c/MinGW/gcc-dev/i686-pc-mingw32/lib/ -isystem /c/MinGW/gcc-dev/i686-pc-mingw32/include -isystem /c/MinGW/gcc-dev/i686-pc-mingw32/sys-include    -E  conftest.c
In file included from d:/dev/other/gcc/build/gcc/include-fixed/syslimits.h:7:0,
                 from d:/dev/other/gcc/build/gcc/include-fixed/limits.h:34,
                 from conftest.c:10:
d:/dev/other/gcc/build/gcc/include-fixed/limits.h:168:61: error: no include path in which to search for limits.h
 #include_next <limits.h>  /* recurse down to the real one */
                                                             ^
configure:3864: $? = 1
configure: failed program was:
| /* confdefs.h */
| #define PACKAGE_NAME "GNU C Runtime Library"
| #define PACKAGE_TARNAME "libgcc"
| #define PACKAGE_VERSION "1.0"
| #define PACKAGE_STRING "GNU C Runtime Library 1.0"
| #define PACKAGE_BUGREPORT ""
| #define PACKAGE_URL "http://www.gnu.org/software/libgcc/"
| /* end confdefs.h.  */
| #ifdef __STDC__
| # include <limits.h>
| #else
| # include <assert.h>
| #endif
|     Syntax error
configure:3864: /d/dev/other/gcc/build/./gcc/xgcc -B/d/dev/other/gcc/build/./gcc/ -L/d/dev/other/gcc/build/i686-pc-mingw32/winsup/mingw -L/d/dev/other/gcc/build/i686-pc-mingw32/winsup/w32api/lib -isystem /d/dev/other/gcc/gcc/winsup/mingw/include -isystem /d/dev/other/gcc/gcc/winsup/w32api/include -B/c/MinGW/gcc-dev/i686-pc-mingw32/bin/ -B/c/MinGW/gcc-dev/i686-pc-mingw32/lib/ -isystem /c/MinGW/gcc-dev/i686-pc-mingw32/include -isystem /c/MinGW/gcc-dev/i686-pc-mingw32/sys-include    -E -traditional-cpp  conftest.c
conftest.c:12:0: fatal error: assert.h: No such file or directory
 # include <assert.h>
 ^
compilation terminated.
configure:3864: $? = 1
configure: failed program was:
| /* confdefs.h */
| #define PACKAGE_NAME "GNU C Runtime Library"
| #define PACKAGE_TARNAME "libgcc"
| #define PACKAGE_VERSION "1.0"
| #define PACKAGE_STRING "GNU C Runtime Library 1.0"
| #define PACKAGE_BUGREPORT ""
| #define PACKAGE_URL "http://www.gnu.org/software/libgcc/"
| /* end confdefs.h.  */
| #ifdef __STDC__
| # include <limits.h>
| #else
| # include <assert.h>
| #endif
|     Syntax error
configure:3864: /d/dev/other/gcc/build/./gcc/xgcc -B/d/dev/other/gcc/build/./gcc/ -L/d/dev/other/gcc/build/i686-pc-mingw32/winsup/mingw -L/d/dev/other/gcc/build/i686-pc-mingw32/winsup/w32api/lib -isystem /d/dev/other/gcc/gcc/winsup/mingw/include -isystem /d/dev/other/gcc/gcc/winsup/w32api/include -B/c/MinGW/gcc-dev/i686-pc-mingw32/bin/ -B/c/MinGW/gcc-dev/i686-pc-mingw32/lib/ -isystem /c/MinGW/gcc-dev/i686-pc-mingw32/include -isystem /c/MinGW/gcc-dev/i686-pc-mingw32/sys-include    -E -traditional-cpp  conftest.c
conftest.c:12:0: fatal error: assert.h: No such file or directory
 # include <assert.h>
 ^
compilation terminated.
configure:3864: $? = 1
configure: failed program was:
| /* confdefs.h */
| #define PACKAGE_NAME "GNU C Runtime Library"
| #define PACKAGE_TARNAME "libgcc"
| #define PACKAGE_VERSION "1.0"
| #define PACKAGE_STRING "GNU C Runtime Library 1.0"
| #define PACKAGE_BUGREPORT ""
| #define PACKAGE_URL "http://www.gnu.org/software/libgcc/"
| /* end confdefs.h.  */
| #ifdef __STDC__
| # include <limits.h>
| #else
| # include <assert.h>
| #endif
|     Syntax error
configure:3864: /lib/cpp  conftest.c
/d/dev/other/gcc/gcc/libgcc/configure: line 1456: /lib/cpp: No such file or directory
configure:3864: $? = 127
configure: failed program was:
| /* confdefs.h */
| #define PACKAGE_NAME "GNU C Runtime Library"
| #define PACKAGE_TARNAME "libgcc"
| #define PACKAGE_VERSION "1.0"
| #define PACKAGE_STRING "GNU C Runtime Library 1.0"
| #define PACKAGE_BUGREPORT ""
| #define PACKAGE_URL "http://www.gnu.org/software/libgcc/"
| /* end confdefs.h.  */
| #ifdef __STDC__
| # include <limits.h>
| #else
| # include <assert.h>
| #endif
|     Syntax error
configure:3864: /lib/cpp  conftest.c
/d/dev/other/gcc/gcc/libgcc/configure: line 1456: /lib/cpp: No such file or directory
configure:3864: $? = 127
configure: failed program was:
| /* confdefs.h */
| #define PACKAGE_NAME "GNU C Runtime Library"
| #define PACKAGE_TARNAME "libgcc"
| #define PACKAGE_VERSION "1.0"
| #define PACKAGE_STRING "GNU C Runtime Library 1.0"
| #define PACKAGE_BUGREPORT ""
| #define PACKAGE_URL "http://www.gnu.org/software/libgcc/"
| /* end confdefs.h.  */
| #ifdef __STDC__
| # include <limits.h>
| #else
| # include <assert.h>
| #endif
|     Syntax error
configure:3903: result: /lib/cpp
configure:3923: /lib/cpp  conftest.c
/d/dev/other/gcc/gcc/libgcc/configure: line 1456: /lib/cpp: No such file or directory
configure:3923: $? = 127
configure: failed program was:
| /* confdefs.h */
| #define PACKAGE_NAME "GNU C Runtime Library"
| #define PACKAGE_TARNAME "libgcc"
| #define PACKAGE_VERSION "1.0"
| #define PACKAGE_STRING "GNU C Runtime Library 1.0"
| #define PACKAGE_BUGREPORT ""
| #define PACKAGE_URL "http://www.gnu.org/software/libgcc/"
| /* end confdefs.h.  */
| #ifdef __STDC__
| # include <limits.h>
| #else
| # include <assert.h>
| #endif
|     Syntax error
configure:3923: /lib/cpp  conftest.c
/d/dev/other/gcc/gcc/libgcc/configure: line 1456: /lib/cpp: No such file or directory
configure:3923: $? = 127
configure: failed program was:
| /* confdefs.h */
| #define PACKAGE_NAME "GNU C Runtime Library"
| #define PACKAGE_TARNAME "libgcc"
| #define PACKAGE_VERSION "1.0"
| #define PACKAGE_STRING "GNU C Runtime Library 1.0"
| #define PACKAGE_BUGREPORT ""
| #define PACKAGE_URL "http://www.gnu.org/software/libgcc/"
| /* end confdefs.h.  */
| #ifdef __STDC__
| # include <limits.h>
| #else
| # include <assert.h>
| #endif
|     Syntax error
configure:3953: error: in `/d/dev/other/gcc/build/i686-pc-mingw32/libgcc':
configure:3956: error: C preprocessor "/lib/cpp" fails sanity check
See `config.log' for more details.


>
>
> ------------------------------------------------------------------------------
> This SF.net email is sponsored by Windows:
>
> Build for Windows Store.
>
> http://p.sf.net/sfu/windows-dev2dev
> _______________________________________________
> MinGW-users mailing list
> [hidden email]
>
> This list observes the Etiquette found at
> http://www.mingw.org/Mailing_Lists.
> We ask that you be polite and do the same.  Disregard for the list etiquette may cause your account to be moderated.
>
> _______________________________________________
> You may change your MinGW Account Options or unsubscribe at:
> https://lists.sourceforge.net/lists/listinfo/mingw-users
> Also: mailto:[hidden email]?subject=unsubscribe


------------------------------------------------------------------------------
This SF.net email is sponsored by Windows:

Build for Windows Store.

http://p.sf.net/sfu/windows-dev2dev
_______________________________________________
MinGW-users mailing list
[hidden email]

This list observes the Etiquette found at
http://www.mingw.org/Mailing_Lists.
We ask that you be polite and do the same.  Disregard for the list etiquette may cause your account to be moderated.

_______________________________________________
You may change your MinGW Account Options or unsubscribe at:
https://lists.sourceforge.net/lists/listinfo/mingw-users
Also: mailto:[hidden email]?subject=unsubscribe